international administration
definition: International administration refers to the exercise of executive and administrative powers in a given territory by an external actor, endorsed by or part of an international organization or multilateral agreement. International administration is associated with conflict resolution and postconflict reconstruction but is a separate category of policy. [Source: The Encyclopedia of Political Science; International Administration]
broader: international relations
type: Concept

concepts
type: Collection
type: ConceptGroup
member: international administration

international relations
type: Concept
narrower: international administration