international research
definition: In conventional curriculum inquiry, there has been a tendency to study curriculum as locally and nationally distinctive. Nonetheless, international research in curriculum studies has often been pursued using comparative and historical approaches, transcending national boundaries. [Source: Encyclopedia of Curriculum Studies; International Research]
broader: inquiry and research
type: Concept

inquiry and research
type: Concept
narrower: international research

concepts
type: Collection
type: ConceptGroup
member: international research