international watershed management
definition: International watershed management refers to the multistakeholder process of creation, implementation, and monitoring of plans, projects, and programs aimed at the sustenance and enhancement of watershed functions across national boundaries. The complexity of the term reflects the complexity of approaching watershed management at an international or transboundary scale. [Source: Encyclopedia of Geography; International Watershed Management]
broader: water
type: Concept

concepts
type: Collection
type: ConceptGroup
member: international watershed management

water
type: Concept
narrower: international watershed management