theories of ethics
type: Concept
narrower: intuitionism

concepts
type: Collection
type: ConceptGroup
member: intuitionism

intuitionism
definition: Ethical intuitionism (or intuitionalism, also known as moral intuitionism) is the doctrine that ethical beliefs can be justified noninferentially through intuition. It designates those philosophical systems that consider intuition as our fundamental moral basis. [Source: Encyclopedia of Business Ethics and Society; Intuitionism]
broader: theories of ethics
type: Concept