isopleth maps
definition: Isopleth maps are a type of thematic map used to display and model observations of phenomena with a continuous distribution by representing the values as a third-dimensional surface draped over the area. This common mapping technique is appropriate for diverse topics. [Source: Encyclopedia of Geography; Isopleth Maps]
broader: cartography
type: Concept

cartography
type: Concept
narrower: isopleth maps

concepts
type: Collection
type: ConceptGroup
member: isopleth maps