career development initiatives
type: Concept
narrower: job-posting programs

concepts
type: Collection
type: ConceptGroup
member: job-posting programs

job-posting programs
definition: Organizational initiatives focused on supporting employees' careers, also referred to as “organizationally supported career management practices,” are geared toward career planning and development. Using job-posting programs, organizations can play a critical role in their employees' career-development efforts by providing accurate and updated information about promotion and growth opportunities within the organization. [Source: Encyclopedia of Career Development; Job-Posting Programs]
broader: career development initiatives
type: Concept