engagement and intervention
type: Concept
narrower: johnson model intervention

concepts
type: Collection
type: ConceptGroup
member: johnson model intervention

johnson model intervention
definition: Vernon Johnson, the founder of the Johnson Institute associated with the Minnesota model of treatment, described the process of intervention that has been widely used in motivating alcoholics-addicts to seek treatment in his books I'll Quit Tomorrow and Intervention: How to Help Someone Who Doesn't Want Help. The Johnson intervention is based on the disease model of addiction. [Source: Encyclopedia of Substance Abuse Prevention, Treatment, & Recovery; Johnson Model Intervention]
broader: engagement and intervention
type: Concept