judicial ghetto
definition: The term judicial ghetto is similar to the concept of prison as an ethnoracial ghetto. This entry provides additional evidence that the burgeoning prison system is modeled after American ghettos. [Source: Encyclopedia of Race and Crime; Prison, Judicial Ghetto]
broader: corrections
type: Concept

corrections
type: Concept
narrower: judicial ghetto

concepts
type: Collection
type: ConceptGroup
member: judicial ghetto