sentencing
type: Concept
narrower: juvenile sentencing

concepts
type: Collection
type: ConceptGroup
member: juvenile sentencing

juvenile sentencing
definition: The creation and proliferation of a separate youth justice system in the United States has not been without debate. How youth are sentenced has changed considerably over time. [Source: Encyclopedia of Criminal Justice Ethics; Juvenile Sentencing]
broader: sentencing
type: Concept