karoshi
definition: Karoshi is defined by Evans (1997) as death from overwork. Karoshi is primarily used for those in pursuit of workers compensation, especially in cases dealing with cardiovascular diseases caused by a tremendous work schedule and the profession. [Source: Dictionary of Multicultural Psychology: Issues, Terms, and Concepts; Karoshi]
broader: cause of death
type: Concept

concepts
type: Collection
type: ConceptGroup
member: karoshi

cause of death
type: Concept
narrower: karoshi