languages and linguistics
type: Concept
narrower: language shift and language loss

concepts
type: Collection
type: ConceptGroup
member: language shift and language loss

language shift and language loss
definition: Every year, all over the planet, languages die. Most of us are unaware of this even when it occurs in our own country. [Source: Encyclopedia of Bilingual Education; Language Shift and Language Loss]
broader: languages and linguistics
type: Concept