theory and methodology
type: Concept
narrower: latent class analysis

latent class analysis
definition: Latent class analysis (LCA) is a method or technique for identifying unlabeled groups of individuals or cases in a data set based on multivariate categorical data. LCA is used in psychology, sociology, and many other areas of application to cluster, or partition, individuals into underlying groups. [Source: Encyclopedia of Measurement and Statistics; Latent Class Analysis]
broader: theory and methodology
type: Concept

methods
type: Collection
type: ConceptGroup
member: latent class analysis