group discussion
type: Concept
narrower: leaderless group discussion

leaderless group discussion
definition: A leaderless group discussion is a situational exercise commonly used in assessment centers, one of the most widely used and heavily researched tools for managerial selection and development. A typical assessment center is composed of situational tests designed to elicit specific managerial behaviors. [Source: Encyclopedia of Health Care Management; Leaderless Group Discussion]
broader: group discussion
type: Concept

concepts
type: Collection
type: ConceptGroup
member: leaderless group discussion