license checks
definition: Police officers regularly request driver's licenses of individuals whom they stop for traffic violations. Police may also ask to see driver's licenses at roadblocks that are designed to stop drunk drivers. [Source: Encyclopedia of the Fourth Amendment; License Checks]
broader: Fourth Amendment issues
type: Concept

Fourth Amendment issues
type: Concept
narrower: license checks

concepts
type: Collection
type: ConceptGroup
member: license checks