licensure and certification
definition: Although frequently used interchangeably, the terms licensure and certification do not, in reality, have the same meanings. Even many state departments of public instruction responsible for regulating school leader licensure often use certificate when they mean license. [Source: Encyclopedia of Educational Leadership and Administration; Licensure and Certification]
broader: government
type: Concept

government
type: Concept
narrower: licensure and certification

concepts
type: Collection
type: ConceptGroup
member: licensure and certification