assessment areas and techniques
type: Concept
narrower: lifestyle preferences

lifestyle preferences
definition: Throughout history, people's positions in society, status, work, and worldview were dictated virtually from birth by the social class/socioeconomic status and other characteristics of their families of origin. Furthermore, men and women were ascribed different roles in society and in the family. [Source: Encyclopedia of Career Development; Lifestyle Preferences]
broader: assessment areas and techniques
type: Concept

concepts
type: Collection
type: ConceptGroup
member: lifestyle preferences