limits of computation
definition: Computer technology has advanced at a pace unprecedented by other technologies. Although such achievements have transformed the human experience, they have also fueled misconceptions about the limits of computation itself. [Source: Encyclopedia of Human Geography; Limits of Computation]
broader: geographic information systems
type: Concept

geographic information systems
type: Concept
narrower: limits of computation

concepts
type: Collection
type: ConceptGroup
member: limits of computation