cartography
type: Concept
narrower: longitude

longitude
definition: Longitude is the angular distance around Earth from a reference plane that defines a prime meridian. A meridian is synonymous with a line of longitude. [Source: Encyclopedia of Geography; Longitude]
broader: cartography
type: Concept

concepts
type: Collection
type: ConceptGroup
member: longitude