audition
type: Concept
narrower: loudness

concepts
type: Collection
type: ConceptGroup
member: loudness

loudness
definition: Loudness is a subjective attribute of sounds that allows us to experience the dynamics of music, speech, and our environment. Sounds can range from soft and calming to so loud that they startle us. [Source: Encyclopedia of Perception; Audition: Loudness]
broader: audition
type: Concept