machine politics
definition: Machine politics refers to politics in which votes are exchanged for discrete benefits. Under machine politics, voting is driven by a direct exchange between voter and political candidate rather than by opinion or ideology. [Source: The Encyclopedia of Political Science; Machine Politics]
broader: political organizations and parties
type: Concept

political organizations and parties
type: Concept
narrower: machine politics

concepts
type: Collection
type: ConceptGroup
member: machine politics