concepts
type: Collection
type: ConceptGroup
member: macrodiets

macrodiets
definition: The macrobiotic diet is defined by philosophy based on well-being and nutrition. The dietary component is similar to a vegetarian diet with emphasis on the quality of the food consumed. [Source: Encyclopedia of Obesity; Macrodiets]
broader: dietary interventions to treat obesity
type: Concept

dietary interventions to treat obesity
type: Concept
narrower: macrodiets