food and nutrition
type: Concept
narrower: macronutrients

macronutrients
definition: elements other than carbon, hydrogen and oxygen, which are required by organisms in substantial amounts, including calcium (Ca. . [Source: Encyclopedia of Environmental Change; macronutrients]
broader: food and nutrition
type: Concept

concepts
type: Collection
type: ConceptGroup
member: macronutrients