constitutions and constitutionalism
type: Concept
narrower: manifesto

concepts
type: Collection
type: ConceptGroup
member: manifesto

manifesto
definition: A manifesto is a document that details the values, principles, and goals of an individual or political organization. Manifestos are generally written as public documents and provide people with information about a group or movement, but manifestos can also be secret and designed to provide internal guidance for an organization or government. [Source: The Encyclopedia of Political Science; Manifesto]
broader: constitutions and constitutionalism
type: Concept