engineering and technological crises
type: Concept
narrower: manufacturing risks

concepts
type: Collection
type: ConceptGroup
member: manufacturing risks

manufacturing risks
definition: There are risks associated with the infrastructure of a manufacturing facility and from external sources. Manufacturing can be defined as the process of taking raw materials and creating finished products. [Source: Encyclopedia of Crisis Management; Manufacturing Risks]
broader: engineering and technological crises
type: Concept