cartography
type: Concept
narrower: map design

map design
definition: Maps remain the primary means of communicating arguments and exploring information in geography. Clear and compelling map design can propel research in geography, while poor design can hinder it. [Source: Encyclopedia of Geography; Map Design]
broader: cartography
type: Concept

concepts
type: Collection
type: ConceptGroup
member: map design