masochism
definition: the practice of deriving sexual pleasure from having pain inflicted. [Source: The Concise Dictionary of Crime and Justice; Masochism]
broader: paraphilias
type: Concept

concepts
type: Collection
type: ConceptGroup
member: masochism

paraphilias
type: Concept
narrower: masochism