matched pairs
definition: A ∗research design in which subjects are matched on characteristics that might affect their reaction to a ∗treatment. After the pairs are determined, one member of each pair is assigned at random to the group receiving treatment (∗experimental group); the other group (∗control group) does not receive treatment. [Source: Dictionary of Statistics & Methodology; Matched Pairs]
broader: analysis of covariance
type: Concept

analysis of covariance
type: Concept
narrower: matched pairs

methods
type: Collection
type: ConceptGroup
member: matched pairs