concepts
type: Collection
type: ConceptGroup
member: media portrayals of Native Americans

media portrayals of Native Americans
definition: Native Americans historically and in the present day are portrayed by media that reflects and alters social realities. Their portrayals, images, representations (misrepresentations and stereotypes) socially construct the realities of culture, collective identity, ideology, and policy. [Source: Encyclopedia of Race and Crime; Media Portrayals of Native Americans]
broader: media
type: Concept

media
type: Concept
narrower: media portrayals of Native Americans