theories
type: Concept
narrower: media practice model

concepts
type: Collection
type: ConceptGroup
member: media practice model

media practice model
definition: The Media Practice Model is a graphic representation that illustrates how adolescents use media in their everyday lives. First presented in 1995, it grew out of a collaborative student/faculty project that explored how teenagers used the mass media (television, radio, magazines, movies, and newspapers) when forging their sexual identities. [Source: Encyclopedia of Children, Adolescents, and the Media; Media Practice Model]
broader: theories
type: Concept