audition
type: Concept
narrower: melody perception

concepts
type: Collection
type: ConceptGroup
member: melody perception

melody perception
definition: Melody consists of a sequence of pitches organized in time. In a melody, it is the pattern of relationships among the pitches that is important, and not the absolute pitch levels. [Source: Encyclopedia of Perception; Melody Perception]
broader: audition
type: Concept