concepts
type: Collection
type: ConceptGroup
member: memory and play

memory and play
definition: As an activity that requires cognitive engagement, play has the capacity to impact memory, both the formation of individual memories and the capacity for improved memory function. Children engaged in play are more adept at memory for several reasons—one reason is that memory is an emotionally charged experience, and emotionally charged experiences are often more readily recalled. [Source: Encyclopedia of Play in Today's Society; Memory and Play]
broader: card games
type: Concept

card games
type: Concept
narrower: memory and play