middle adulthood
definition: Human development is studied by the broad field of psychology and within the subfield of developmental psychology. Developmental psychology is defined as the study of stability and change throughout the life course. [Source: Encyclopedia of Human Development; Middle Adulthood]
broader: middle and young adulthood
type: Concept

concepts
type: Collection
type: ConceptGroup
member: middle adulthood

middle and young adulthood
type: Concept
narrower: middle adulthood