middle school mathematics curriculum
definition: Mathematics is an intellectually demanding, challenging, and exciting content area and, for some students, a content area upon which a future career can be built. The child's informal mathematical future begins with the parent but formally begins the moment she or he walks through the schoolhouse door. [Source: Encyclopedia of Giftedness, Creativity, and Talent; Middle School, Mathematics Curriculum]
broader: middle school curriculum
type: Concept

concepts
type: Collection
type: ConceptGroup
member: middle school mathematics curriculum

middle school curriculum
type: Concept
narrower: middle school mathematics curriculum