middle school writing curriculum
definition: The development of effective skills of written communication is a core academic enterprise in the middle school. Writing is generally not, however, considered an academic discipline or subject area in itself, but rather a set of skills developed and applied across all disciplines in the service of multiple purposes. [Source: Encyclopedia of Giftedness, Creativity, and Talent; Middle School, Writing Curriculum]
broader: middle school curriculum
type: Concept

concepts
type: Collection
type: ConceptGroup
member: middle school writing curriculum

middle school curriculum
type: Concept
narrower: middle school writing curriculum