climatology
type: Concept
narrower: midlatitude severe climate

midlatitude severe climate
definition: Severe climates of the midlatitudes include humid continental and subarctic climates. These climate types are typified by harsh winters and large annual temperature ranges due to continentality. [Source: Encyclopedia of Geography; Climate: Midlatitude, Severe]
broader: climatology
type: Concept

concepts
type: Collection
type: ConceptGroup
member: midlatitude severe climate