security and classification
type: Concept
narrower: minimum security

minimum security
definition: a level of security in correctional facilities for inmates who pose the least amount of risk for escape or rule infraction. Compare with close security, maximum security, medium security, trusty security. [Source: The Concise Dictionary of Crime and Justice; Minimum Security]
broader: security and classification
type: Concept

concepts
type: Collection
type: ConceptGroup
member: minimum security