model minorities
definition: The phrase model minority stereotype is used in the social sciences to describe a racial minority group that has excelled in the United States despite prejudice and discrimination. Specifically, this stereotype has become synonymous with the Asian American population. [Source: Encyclopedia of Race and Crime; Model Minorities]
broader: specific populations
type: Concept

specific populations
type: Concept
narrower: model minorities

concepts
type: Collection
type: ConceptGroup
member: model minorities