models of policy process
definition: The term model has multiple meanings. This being so in general, in political science the varying use of the term reflects the diversity of stances on philosophical and methodological issues in this discipline. [Source: International Encyclopedia of Political Science; Policy Process, Models of]
broader: public policy
type: Concept

concepts
type: Collection
type: ConceptGroup
member: models of policy process

public policy
type: Concept
narrower: models of policy process