physiological processes
type: Concept
narrower: modularity

concepts
type: Collection
type: ConceptGroup
member: modularity

modularity
definition: Modularity implies self-contained, sometimes repeating, units. Modules can be large complex units (such as modules for homes containing large subparts) or small, more uniform units (such as the bricks in the wall of that home). [Source: Encyclopedia of Perception; Modularity]
broader: physiological processes
type: Concept