moral point of view
definition: The moral point of view is the impartial, universalizable perspective that each person is capable of assuming. Here the term person is used in a technical sense to denote rational, self-governing being. [Source: Encyclopedia of Business Ethics and Society; Moral Point of View]
broader: theories of ethics
type: Concept

theories of ethics
type: Concept
narrower: moral point of view

concepts
type: Collection
type: ConceptGroup
member: moral point of view