moral sentimentalism
definition: Moral sentimentalism is the view that human sentiments—feelings, emotions, or other affective states—are fundamental to an account of moral evaluation, awareness, and motivation. According to sentimentalists, objects of moral evaluation—actions, motives, and character—are morally right or wrong (or virtuous or vicious) depending on whether we feel approval or disapproval toward them. [Source: Encyclopedia of Business Ethics and Society; Moral Sentimentalism]
broader: theories of ethics
type: Concept

theories of ethics
type: Concept
narrower: moral sentimentalism

concepts
type: Collection
type: ConceptGroup
member: moral sentimentalism