moral standing
definition: Moral standing is a concept that relates to what ethicists call “moral considerability.” Here, the moral status of an entity is determined by considering whether that entity deserves to have their well-being taken into account within the context of moral decision making. To ask if an entity has moral standing is to ask whether that entity should be considered in the moral judgments that people make and the moral decisions that they take, and whether that entity should count as a morally valued being and whether it can make moral claims on other moral beings. [Source: Encyclopedia of Business Ethics and Society; Moral Standing]
broader: theories of ethics
type: Concept

theories of ethics
type: Concept
narrower: moral standing

concepts
type: Collection
type: ConceptGroup
member: moral standing