networks and networking
type: Concept
narrower: muds and moos

concepts
type: Collection
type: ConceptGroup
member: muds and moos

muds and moos
definition: MUDs and MOOs are computer programs that allow multiple users from remote locations to interact with the program and communicate with each other. The acronym MUD originally stood for Multi-User Dungeon, and is also sometimes translated as Multi-User Dimension or Multi-User Domain. [Source: Encyclopedia of New Media; MUDs and MOOs]
broader: networks and networking
type: Concept