inquiry and research
type: Concept
narrower: multi-vocal research

methods
type: Collection
type: ConceptGroup
member: multi-vocal research

multi-vocal research
definition: Multi-vocal research often embodies the perspectives of diverse sets of authors such as academics, journalists, policy makers, classroom teachers, and parents. This method of writing aims to democratize research in curriculum studies by incorporating multiple perspectives rather than placing in relief the perspectives of a privileged group or dominant epistemic traditions. [Source: Encyclopedia of Curriculum Studies; Multi-Vocal research]
broader: inquiry and research
type: Concept