cartography
type: Concept
narrower: multimedia mapping

concepts
type: Collection
type: ConceptGroup
member: multimedia mapping

multimedia mapping
definition: Multimedia mapping refers to the integration of computer-assisted mapping systems and multimedia technologies that allow the incorporation of both spatial geographic (i.e., geospatial) information in digital map format and multimedia information. The term multimedia implies the use of a personal computer (PC) or the Internet with information presented through the following media: (1) text (descriptive text, narrative, and labels), (2) graphics (drawings, diagrams, charts, snapshots, or photographs), (3) digital video (television-style material in digital format), (4) digital audio sound (music and oral narration), and (5) computer animation (changing maps, objects, and images). [Source: Encyclopedia of Geography; Multimedia Mapping]
broader: cartography
type: Concept