multiplexed networks
definition: A multiplexed network, defined as a network with multiple and overlapping content relations, emerges from the dyadic multiplexity of its network ties. A network tie specifies a relationship between two actors and is the conduit or channel through which different types of content may flow between them—such as friendship or finances—and be maintained, transferred, or exchanged. [Source: Encyclopedia of Social Networks; Multiplexed Networks]
broader: social network analysis
type: Concept

social network analysis
type: Concept
narrower: multiplexed networks

concepts
type: Collection
type: ConceptGroup
member: multiplexed networks