naming
definition: African religion is expressed in the names of people and places. Most African names of people and places have symbolic meanings that are religious in nature. [Source: Encyclopedia of African Religion; Naming]
broader: language processing
type: Concept

concepts
type: Collection
type: ConceptGroup
member: naming

language processing
type: Concept
narrower: naming