need to belong
definition: Definition The need to belong refers to the idea that humans have a fundamental motivation to be accepted into relationships with others and to be a part of social groups. The fact that belongingness is a need means that human beings must establish and maintain a minimum quantity of enduring relationships. [Source: Encyclopedia of Social Psychology; Need to Belong]
broader: interpersonal relationships
type: Concept

concepts
type: Collection
type: ConceptGroup
member: need to belong

interpersonal relationships
type: Concept
narrower: need to belong