micro-interactionist theory
type: Concept
narrower: negotiated order

concepts
type: Collection
type: ConceptGroup
member: negotiated order

negotiated order
definition: Negotiated order is a theoretical perspective developed primarily by Anselm Strauss (1917–1996), who argued that virtually all social order is negotiated order. To accomplish tasks in social settings, people chiefly negotiate with each other. [Source: Encyclopedia of Social Theory; Negotiated Order]
broader: micro-interactionist theory
type: Concept