community-based housing
type: Concept
narrower: neighborhood stabilization program

neighborhood stabilization program
definition: The Neighborhood Stabilization Program (NSP) is the term used to describe the activities authorized by three congressional appropriations made in 2008, 2009, and 2010, which enabled states, local governments, and nonprofit entities to acquire and reuse foreclosed and abandoned properties. The NSP was a major new federal initiative to help states and localities address the effects of the foreclosure crisis and can be considered the most important federal housing and urban revitalization initiative of the first decade of the 2000s. [Source: The Encyclopedia of Housing; Neighborhood Stabilization Program]
broader: community-based housing
type: Concept

concepts
type: Collection
type: ConceptGroup
member: neighborhood stabilization program